Target
Glucocorticoid receptor
Ligand
BDBM50001763
Substrate
Meas. Tech.
ChEMBL_1338546 (CHEMBL3241423)
IC50
4.0±n/a nM
Citation
 Razavi, HRiether, DHarcken, CBentzien, JDinallo, RMSouza, DNelson, RMKukulka, AFadra-Khan, TNPack, EJZuvela-Jelaska, LPelletier, JPanzenbeck, MTorcellini, CAProudfoot, JRNabozny, GHThomson, DS Discovery of a potent and dissociated non-steroidal glucocorticoid receptor agonist containing an alkyl carbinol pharmacophore. Bioorg Med Chem Lett 24:1934-40 (2014)  
Target
Name:
Glucocorticoid receptor
Synonyms:
GCR_HUMAN GRL Glucocorticoid receptor (GRFP) Nuclear receptor subfamily 3 group C member 1
Type:
Enzyme
Mol. Mass.:
85656.87
Organism:
Homo sapiens (Human)
Description:
P04150
Residue:
777
  
Inhibitor
Name:
BDBM50001763
Synonyms:
CHEMBL3233277
Type:
Small organic molecule
Emp. Form.:
C24H31FN2O2
Mol. Mass.:
398.5135
SMILES:
COc1ccc(F)cc1C(C)(C)CC(O)(Cc1cc2cnccc2[nH]1)C(C)(C)C
: