Target
Acetylcholinesterase
Ligand
BDBM50005552
Substrate
Meas. Tech.
ChEMBL_1338714 (CHEMBL3242185)
IC50
130000±n/a nM
Citation
 Kliachyna, MSantoni, GNussbaum, VRenou, JSanson, BColletier, JPArboléas, MLoiodice, MWeik, MJean, LRenard, PYNachon, FBaati, R Design, synthesis and biological evaluation of novel tetrahydroacridine pyridine- aldoxime and -amidoxime hybrids as efficient uncharged reactivators of nerve agent-inhibited human acetylcholinesterase. Eur J Med Chem 78:455-67 (2014)  
Target
Name:
Acetylcholinesterase
Synonyms:
ACES_HUMAN Acetylcholinesterase (AChE) | Acetylcholinesterase (human AChE)
Type:
Enzyme
Mol. Mass.:
67792.70
Organism:
Homo sapiens (Human)
Description:
P22303
Residue:
614
  
Inhibitor
Name:
BDBM50005552
Synonyms:
CHEMBL141859 | CHEMBL3234594
Type:
Small organic molecule
Emp. Form.:
C23H26N2S
Mol. Mass.:
362.531
SMILES:
C(CCSc1c2CCCCc2nc2ccccc12)CCc1ccccn1
: