Target
Estrogen receptor beta
Ligand
BDBM50005603
Substrate
Meas. Tech.
ChEMBL_1339080 (CHEMBL3243177)
IC50
6.0±n/a nM
Citation
 Liao, ZQDong, CCarlson, KESrinivasan, SNwachukwu, JCChesnut, RWSharma, ANettles, KWKatzenellenbogen, JAZhou, HB Triaryl-substituted Schiff bases are high-affinity subtype-selective ligands for the estrogen receptor. J Med Chem 57:3532-45 (2014)  
Target
Name:
Estrogen receptor beta
Synonyms:
ER-beta ESR2_HUMAN Estradiol receptor beta (ERβ) Estrogen receptor (ER beta) Estrogen receptor beta (ER beta) NR3A2 estrogen beta
Type:
Protein
Mol. Mass.:
59238.43
Organism:
Homo sapiens (Human)
Description:
Q92731
Residue:
530
  
Inhibitor
Name:
BDBM50005603
Synonyms:
CHEMBL3234630
Type:
Small organic molecule
Emp. Form.:
C19H14ClNO3
Mol. Mass.:
339.772
SMILES:
Oc1ccc(cc1)C(=N/c1ccccc1Cl)\c1ccc(O)cc1O
: