Target
Androgen receptor
Ligand
BDBM50007598
Substrate
Meas. Tech.
ChEMBL_1339117 (CHEMBL3243252)
EC50
0.110000±n/a nM
Citation
 Piatnitski Chekler, ELUnwalla, RKhan, TATangirala, RSJohnson, MSt Andre, MAnderson, JTKenney, TChiparri, SMcNally, CKilbourne, EThompson, CNagpal, SWeber, GSchelling, SOwens, JMorris, CAPowell, DVerhoest, PRGilbert, AM 1-(2-Hydroxy-2-methyl-3-phenoxypropanoyl)indoline-4-carbonitrile derivatives as potent and tissue selective androgen receptor modulators. J Med Chem 57:2462-71 (2014)  
Target
Name:
Androgen receptor
Synonyms:
ANDR_HUMAN Androgen Receptor Androgen receptor/Baculoviral IAP repeat-containing protein 2 Dihydrotestosterone receptor Nuclear receptor subfamily 3 group C member 4
Type:
Receptor
Mol. Mass.:
99185.27
Organism:
Homo sapiens (Human)
Description:
CHO cells were stably transfected with human AR gene.
Residue:
920
  
Inhibitor
Name:
BDBM50007598
Synonyms:
CHEMBL3233072
Type:
Small organic molecule
Emp. Form.:
C19H16BrFN2O3
Mol. Mass.:
419.244
SMILES:
C[C@](O)(COc1ccc(Br)cc1F)C(=O)N1CCc2c1cccc2C#N
: