Target
Gamma-butyrobetaine dioxygenase
Ligand
BDBM50007937
Substrate
Meas. Tech.
ChEMBL_1337520 (CHEMBL3242135)
IC50
>1000000±n/a nM
Citation
 Tars, KLeitans, JKazaks, AZelencova, DLiepinsh, EKuka, JMakrecka, MLola, DAndrianovs, VGustina, DGrinberga, SLiepinsh, EKalvinsh, IDambrova, MLoza, EPugovics, O Targeting carnitine biosynthesis: discovery of new inhibitors against¿-butyrobetaine hydroxylase. J Med Chem 57:2213-36 (2014)  
Target
Name:
Gamma-butyrobetaine dioxygenase
Synonyms:
BBH BBOX1 Gamma-BBH Gamma-butyrobetaine,2-oxoglutarate dioxygenase
Type:
PROTEIN
Mol. Mass.:
44715.93
Organism:
Homo sapiens (Human)
Description:
ChEMBL_1434107
Residue:
387
  
Inhibitor
Name:
BDBM50007937
Synonyms:
CHEMBL3234355
Type:
Small organic molecule
Emp. Form.:
C9H19NO2
Mol. Mass.:
173.2527
SMILES:
CCC[N+](C)(C)CCCC([O-])=O
: