Target
Gamma-butyrobetaine dioxygenase
Ligand
BDBM50007967
Substrate
Meas. Tech.
ChEMBL_1337520 (CHEMBL3242135)
IC50
260±n/a nM
Citation
 Tars, KLeitans, JKazaks, AZelencova, DLiepinsh, EKuka, JMakrecka, MLola, DAndrianovs, VGustina, DGrinberga, SLiepinsh, EKalvinsh, IDambrova, MLoza, EPugovics, O Targeting carnitine biosynthesis: discovery of new inhibitors against¿-butyrobetaine hydroxylase. J Med Chem 57:2213-36 (2014)  
Target
Name:
Gamma-butyrobetaine dioxygenase
Synonyms:
BBH BBOX1 Gamma-BBH Gamma-butyrobetaine,2-oxoglutarate dioxygenase
Type:
PROTEIN
Mol. Mass.:
44715.93
Organism:
Homo sapiens (Human)
Description:
ChEMBL_1434107
Residue:
387
  
Inhibitor
Name:
BDBM50007967
Synonyms:
CHEMBL3234364
Type:
Small organic molecule
Emp. Form.:
C8H17Cl2NO2
Mol. Mass.:
230.132
SMILES:
[Cl-].C[N+](C)(CCCl)CCCC(O)=O
: