Target
Mu-type opioid receptor
Ligand
BDBM50008834
Substrate
Meas. Tech.
ChEMBL_1337158 (CHEMBL3240189)
IC50
2.0±n/a nM
Citation
 Bai, LLi, ZChen, JChung, NNWilkes, BCLi, TSchiller, PW [Dmt(1)]DALDA analogues with enhancedµ opioid agonist potency and with a mixedµ/¿ opioid activity profile. Bioorg Med Chem 22:2333-8 (2014)  
Target
Name:
Mu-type opioid receptor
Synonyms:
M-OR-1 Mu opioid receptor OPIATE Mu OPRM_CAVPO
Type:
Enzyme Catalytic Domain
Mol. Mass.:
11165.58
Organism:
GUINEA PIG
Description:
P97266
Residue:
98
  
Inhibitor
Name:
BDBM50008834
Synonyms:
CHEMBL3236671
Type:
Small organic molecule
Emp. Form.:
C34H52N8O6
Mol. Mass.:
668.8267
SMILES:
Cc1cccc(C)c1C[C@H](NC(=O)[C@@H](CCCNC(N)=N)NC(=O)[C@@H](N)Cc1c(C)cc(O)cc1C)C(=O)N[C@@H](CCCCN)C(O)=O
: