Target
Melatonin receptor type 1A
Ligand
BDBM50125757
Substrate
Meas. Tech.
ChEMBL_1352268 (CHEMBL3268986)
Ki
0.600000±n/a nM
Citation
 Zlotos, DPJockers, RCecon, ERivara, SWitt-Enderby, PA MT1 and MT2 melatonin receptors: ligands, models, oligomers, and therapeutic potential. J Med Chem 57:3161-85 (2014)  
Target
Name:
Melatonin receptor type 1A
Synonyms:
MTNR1A MTR1A_HUMAN Mel1a melatonin receptor Melatonin receptor Melatonin receptor type 1 (MT1) | Melatonin receptor type 1A
Type:
Enzyme
Mol. Mass.:
39392.94
Organism:
Homo sapiens (Human)
Description:
P48039
Residue:
350
  
Inhibitor
Name:
BDBM50125757
Synonyms:
CHEMBL14453 N-[2-(7-{4-[8-(2-Acetylamino-ethyl)-naphthalen-2-yloxy]-butoxy}-naphthalen-1-yl)-ethyl]-acetamide
Type:
Small organic molecule
Emp. Form.:
C32H36N2O4
Mol. Mass.:
512.6392
SMILES:
CC(=O)NCCc1cccc2ccc(OCCCCOc3ccc4cccc(CCNC(C)=O)c4c3)cc12
: