Target
Muscarinic acetylcholine receptor M2
Ligand
BDBM75566
Substrate
Meas. Tech.
ChEMBL_1352901 (CHEMBL3269418)
Ki
<1000±n/a nM
Citation
 Urbano, MGuerrero, MRosen, HRoberts, E Antagonists of the kappa opioid receptor. Bioorg Med Chem Lett 24:2021-32 (2014)  
Target
Name:
Muscarinic acetylcholine receptor M2
Synonyms:
ACM2_HUMAN Cholinergic, muscarinic M2 Muscarinic acetylcholine receptor M2 and M5 | RecName: Full=Muscarinic acetylcholine receptor M2
Type:
GPCR
Mol. Mass.:
51730.61
Organism:
Homo sapiens (Human)
Description:
P08172
Residue:
466
  
Inhibitor
Name:
BDBM75566
Synonyms:
KSC-11-114-1 N-[2-[benzyl(tert-butyl)amino]ethyl]-4-[(tosylamino)methyl]benzamide N-[2-[tert-butyl-(phenylmethyl)amino]ethyl]-4-[[(4-methylphenyl)sulfonylamino]methyl]benzamide | cid_45115589
Type:
Small organic molecule
Emp. Form.:
C28H35N3O3S
Mol. Mass.:
493.661
SMILES:
Cc1ccc(cc1)S(=O)(=O)NCc1ccc(cc1)C(=O)NCCN(Cc1ccccc1)C(C)(C)C
: