Target
Kappa-type opioid receptor
Ligand
BDBM71581
Substrate
Meas. Tech.
ChEMBL_1352794 (CHEMBL3268194)
IC50
660±n/a nM
Citation
 Urbano, MGuerrero, MRosen, HRoberts, E Antagonists of the kappa opioid receptor. Bioorg Med Chem Lett 24:2021-32 (2014)  
Target
Name:
Kappa-type opioid receptor
Synonyms:
K-OR-1 Kappa-opioid receptor (KOR) Kappa-type opioid receptor (KOR) OPIATE Kappa OPRK1 kappa opioid receptor (KOR)
Type:
G Protein-Coupled Receptor (GPCR)
Mol. Mass.:
42648.76
Organism:
Homo sapiens (Human)
Description:
P41145
Residue:
380
  
Inhibitor
Name:
BDBM71581
Synonyms:
KSC-5-280C N-[2-[(4-bromobenzyl)-isopropyl-amino]ethyl]-4-[(tosylamino)methyl]benzamide N-[2-[(4-bromophenyl)methyl-propan-2-ylamino]ethyl]-4-[[(4-methylphenyl)sulfonylamino]methyl]benzamide | cid_44620907
Type:
Small organic molecule
Emp. Form.:
C27H32BrN3O3S
Mol. Mass.:
558.53
SMILES:
CC(C)N(CCNC(=O)c1ccc(CNS(=O)(=O)c2ccc(C)cc2)cc1)Cc1ccc(Br)cc1
: