Target
Kappa-type opioid receptor
Ligand
BDBM71611
Substrate
Meas. Tech.
ChEMBL_1352794 (CHEMBL3268194)
IC50
690±n/a nM
Citation
 Urbano, MGuerrero, MRosen, HRoberts, E Antagonists of the kappa opioid receptor. Bioorg Med Chem Lett 24:2021-32 (2014)  
Target
Name:
Kappa-type opioid receptor
Synonyms:
K-OR-1 Kappa-opioid receptor (KOR) Kappa-type opioid receptor (KOR) OPIATE Kappa OPRK1 kappa opioid receptor (KOR)
Type:
G Protein-Coupled Receptor (GPCR)
Mol. Mass.:
42648.76
Organism:
Homo sapiens (Human)
Description:
P41145
Residue:
380
  
Inhibitor
Name:
BDBM71611
Synonyms:
KSC-1-261 cid_44665687
Type:
Small organic molecule
Emp. Form.:
C26H29ClN6O2
Mol. Mass.:
493
SMILES:
Cc1ccnc2n(CC(=O)NCCCN3CCN(CC3)c3ccc(Cl)cc3)c(=O)c3cccn3c12
: