Target
Kappa-type opioid receptor
Ligand
BDBM54817
Substrate
Meas. Tech.
ChEMBL_1352795 (CHEMBL3268195)
IC50
860±n/a nM
Citation
 Urbano, MGuerrero, MRosen, HRoberts, E Antagonists of the kappa opioid receptor. Bioorg Med Chem Lett 24:2021-32 (2014)  
Target
Name:
Kappa-type opioid receptor
Synonyms:
K-OR-1 Kappa-opioid receptor (KOR) Kappa-type opioid receptor (KOR) OPIATE Kappa OPRK1 kappa opioid receptor (KOR)
Type:
G Protein-Coupled Receptor (GPCR)
Mol. Mass.:
42648.76
Organism:
Homo sapiens (Human)
Description:
P41145
Residue:
380
  
Inhibitor
Name:
BDBM54817
Synonyms:
4-[[(4-methylphenyl)sulfonylamino]methyl]-N-[2-[(phenylmethyl)-propan-2-yl-amino]ethyl]benzamide MLS000682490 N-[2-[benzyl(propan-2-yl)amino]ethyl]-4-[[(4-methylphenyl)sulfonylamino]methyl]benzamide SMR000314971 | cid_3342390
Type:
Small organic molecule
Emp. Form.:
C27H33N3O3S
Mol. Mass.:
479.634
SMILES:
CC(C)N(CCNC(=O)c1ccc(CNS(=O)(=O)c2ccc(C)cc2)cc1)Cc1ccccc1
: