Target
Prostaglandin G/H synthase 2
Ligand
BDBM50015580
Substrate
Meas. Tech.
ChEMBL_1348631 (CHEMBL3268342)
IC50
58000±n/a nM
Citation
 Bansal, SBala, MSuthar, SKChoudhary, SBhattacharya, SBhardwaj, VSingla, SJoseph, A Design and synthesis of novel 2-phenyl-5-(1,3-diphenyl-1H-pyrazol-4-yl)-1,3,4-oxadiazoles as selective COX-2 inhibitors with potent anti-inflammatory activity. Eur J Med Chem 80:167-74 (2014)  
Target
Name:
Prostaglandin G/H synthase 2
Synonyms:
COX2 Cyclooxygenase 2 (COX-2) Cyclooxygenase-2 (COX-2 AA) Cyclooxygenase-2 (COX-2) PGH2_HUMAN PHS II Prostaglandin E synthase/G/H synthase 2 Prostaglandin-endoperoxide synthase 2
Type:
Enzyme
Mol. Mass.:
69003.89
Organism:
Homo sapiens (Human)
Description:
Recombinant Cox-2 provided by Cayman (Cayman Chemical Co.,Ann Arbor, MI).
Residue:
604
  
Inhibitor
Name:
BDBM50015580
Synonyms:
CHEMBL3265346
Type:
Small organic molecule
Emp. Form.:
C24H17ClN4O
Mol. Mass.:
412.871
SMILES:
Cc1ccc(cc1)-c1nn(cc1-c1nnc(o1)-c1ccc(Cl)cc1)-c1ccccc1
: