Target
Thymidylate synthase
Ligand
BDBM50332929
Substrate
Meas. Tech.
ChEMBL_1358288 (CHEMBL3284705)
Ki
15500±n/a nM
Citation
 Wataya, YSanti, DVHansch, C Inhibition of Lactobacillus casei thymidylate synthetase by 5-substituted 2'-deoxyuridylates. Preliminary quantitative structure-activity relationship. J Med Chem 20:1469-73 (1977)  
Target
Name:
Thymidylate synthase
Synonyms:
TSase Thymidylate Synthase (TS) thyA
Type:
Enzyme
Mol. Mass.:
36576.54
Organism:
Lactobacillus casei
Description:
Residue:
316
  
Inhibitor
Name:
BDBM50332929
Synonyms:
((2R,3S,5R)-3-hydroxy-5-(5-methyl-2,4-dioxo-3,4-dihydropyrimidin-1(2H)-yl)-tetrahydrofuran-2-yl)methyl dihydrogen phosphate 2'-deoxythymidine monophosphate Phosphoric acid mono-[3-hydroxy-5-(5-methyl-2,4-dioxo-3,4-dihydro-2H-pyrimidin-1-yl)-tetrahydro-furan-2-ylmethyl] ester US11111252, Compound TMP thymidine-5'-phosphate
Type:
Small organic molecule
Emp. Form.:
C10H15N2O8P
Mol. Mass.:
322.2085
SMILES:
Cc1cn([C@H]2C[C@H](O)[C@@H](COP(O)(O)=O)O2)c(=O)[nH]c1=O
: