Target
Thymidylate synthase
Ligand
BDBM50016806
Substrate
Meas. Tech.
ChEMBL_1358288 (CHEMBL3284705)
Ki
17±n/a nM
Citation
 Wataya, YSanti, DVHansch, C Inhibition of Lactobacillus casei thymidylate synthetase by 5-substituted 2'-deoxyuridylates. Preliminary quantitative structure-activity relationship. J Med Chem 20:1469-73 (1977)  
Target
Name:
Thymidylate synthase
Synonyms:
TSase Thymidylate Synthase (TS) thyA
Type:
Enzyme
Mol. Mass.:
36576.54
Organism:
Lactobacillus casei
Description:
Residue:
316
  
Inhibitor
Name:
BDBM50016806
Synonyms:
CHEMBL1236552
Type:
Small organic molecule
Emp. Form.:
C10H13N2O9P
Mol. Mass.:
336.192
SMILES:
O[C@H]1C[C@@H](O[C@@H]1COP(O)(O)=O)n1cc(C=O)c(=O)[nH]c1=O
: