Target
Thymidylate synthase
Ligand
BDBM50016805
Substrate
Meas. Tech.
ChEMBL_1358290 (CHEMBL3284707)
Ki
3900±n/a nM
Citation
 Wataya, YSanti, DVHansch, C Inhibition of Lactobacillus casei thymidylate synthetase by 5-substituted 2'-deoxyuridylates. Preliminary quantitative structure-activity relationship. J Med Chem 20:1469-73 (1977)  
Target
Name:
Thymidylate synthase
Synonyms:
TSase Thymidylate Synthase (TS) thyA
Type:
Enzyme
Mol. Mass.:
36576.54
Organism:
Lactobacillus casei
Description:
Residue:
316
  
Inhibitor
Name:
BDBM50016805
Synonyms:
CHEMBL3274191
Type:
Small organic molecule
Emp. Form.:
C10H15N2O10P
Mol. Mass.:
354.2073
SMILES:
OCc1cn([C@@H]2O[C@H](COP(O)(O)=O)[C@@H](O)[C@H]2O)c(=O)[nH]c1=O
: