Target
Thymidylate synthase
Ligand
BDBM50010239
Substrate
Meas. Tech.
ChEMBL_1358290 (CHEMBL3284707)
Ki
9390±n/a nM
Citation
 Wataya, YSanti, DVHansch, C Inhibition of Lactobacillus casei thymidylate synthetase by 5-substituted 2'-deoxyuridylates. Preliminary quantitative structure-activity relationship. J Med Chem 20:1469-73 (1977)  
Target
Name:
Thymidylate synthase
Synonyms:
TSase Thymidylate Synthase (TS) thyA
Type:
Enzyme
Mol. Mass.:
36576.54
Organism:
Lactobacillus casei
Description:
Residue:
316
  
Inhibitor
Name:
BDBM50010239
Synonyms:
CHEMBL1236538
Type:
Small organic molecule
Emp. Form.:
C9H12ClN2O8P
Mol. Mass.:
342.627
SMILES:
O[C@H]1C[C@@H](O[C@@H]1COP(O)(O)=O)n1cc(Cl)c(=O)[nH]c1=O
: