Target
Thymidylate synthase
Ligand
BDBM50022238
Substrate
Meas. Tech.
ChEMBL_1358290 (CHEMBL3284707)
Ki
14900±n/a nM
Citation
 Wataya, YSanti, DVHansch, C Inhibition of Lactobacillus casei thymidylate synthetase by 5-substituted 2'-deoxyuridylates. Preliminary quantitative structure-activity relationship. J Med Chem 20:1469-73 (1977)  
Target
Name:
Thymidylate synthase
Synonyms:
TSase Thymidylate Synthase (TS) thyA
Type:
Enzyme
Mol. Mass.:
36576.54
Organism:
Lactobacillus casei
Description:
Residue:
316
  
Inhibitor
Name:
BDBM50022238
Synonyms:
(R)-5-Fluoro-1-((4S,5R)-4-hydroxy-5-methylphosphate-tetrahydro-furan-2-yl)-1H-pyrimidine-2,4-dione 5-Fluoro-2-Deoxyuridine Monophosphate (Fdump) Phosphoric acid mono-[(2R,3S,5R)-5-(5-fluoro-2,4-dioxo-3,4-dihydro-2H-pyrimidin-1-yl)-3-hydroxy-tetrahydro-furan-2-ylmethyl] ester | Phosphoric acid mono-[5-(5-fluoro-2,4-dioxo-3,4-dihydro-2H-pyrimidin-1-yl)-3-hydroxy-tetrahydro-furan-2-ylmethyl] ester
Type:
Small organic molecule
Emp. Form.:
C9H12FN2O8P
Mol. Mass.:
326.1723
SMILES:
O[C@H]1C[C@@H](O[C@@H]1COP(O)(O)=O)n1cc(F)c(=O)[nH]c1=O
: