Target
Cytochrome P450 2C9
Ligand
BDBM50017299
Substrate
Meas. Tech.
ChEMBL_1362434 (CHEMBL3292790)
IC50
<1000±n/a nM
Citation
 De Savi, CCox, RJWarner, DJCook, ARDickinson, MRMcDonough, AMorrill, LCParker, BAndrews, GYoung, SSGilmour, PSRiley, RDearman, MS Efficacious inhaled PDE4 inhibitors with low emetic potential and long duration of action for the treatment of COPD. J Med Chem 57:4661-76 (2014)  
Target
Name:
Cytochrome P450 2C9
Synonyms:
(R)-limonene 6-monooxygenase CP2C9_HUMAN CYP2C9 Cytochrome P450 2C9 (CYP2C9 ) P-450MP P450 PB-1 | S-mephenytoin 4-hydroxylase
Type:
Enzyme
Mol. Mass.:
55636.33
Organism:
Homo sapiens (Human)
Description:
P11712
Residue:
490
  
Inhibitor
Name:
BDBM50017299
Synonyms:
CHEMBL3288011
Type:
Small organic molecule
Emp. Form.:
C40H44FN7O3
Mol. Mass.:
689.8209
SMILES:
C[C@H]1CN(Cc2ccc(cc2)-c2cccc(Oc3ncc(F)cc3C(=O)N[C@@H]3CC[C@@H](CC3)NC(=O)c3cn4c(C)cccc4n3)c2)C[C@@H](C)N1
: