Target
5-hydroxytryptamine receptor 4
Ligand
BDBM50019525
Substrate
Meas. Tech.
ChEMBL_1366555 (CHEMBL3296578)
Ki
105±n/a nM
Citation
 Castriconi, FPaolino, MGiuliani, GAnzini, MCampiani, GMennuni, LSabatini, CLanza, MCaselli, GDe Rienzo, FMenziani, MCSbraccia, MMolinari, PCosta, TCappelli, A Synthesis and structure-activity relationship studies in serotonin 5-HT4 receptor ligands based on a benzo[de][2,6]naphthridine scaffold. Eur J Med Chem 82:36-46 (2014)  
Target
Name:
5-hydroxytryptamine receptor 4
Synonyms:
5-HT4 5HT4R_CAVPO Serotonin 4 (5-HT4) receptor
Type:
Enzyme Catalytic Domain
Mol. Mass.:
43735.29
Organism:
GUINEA PIG
Description:
5-HT4 HTR4 GUINEA PIG::O70528
Residue:
388
  
Inhibitor
Name:
BDBM50019525
Synonyms:
CHEMBL3291080
Type:
Small organic molecule
Emp. Form.:
C19H20ClN3O2
Mol. Mass.:
357.834
SMILES:
Clc1cc2C(=O)N(CCCN3CCCCC3)C(=O)c3cccc(n1)c23
: