Target
5-hydroxytryptamine receptor 4
Ligand
BDBM50019522
Substrate
Meas. Tech.
ChEMBL_1366557 (CHEMBL3296580)
IC50
916±n/a nM
Citation
 Castriconi, FPaolino, MGiuliani, GAnzini, MCampiani, GMennuni, LSabatini, CLanza, MCaselli, GDe Rienzo, FMenziani, MCSbraccia, MMolinari, PCosta, TCappelli, A Synthesis and structure-activity relationship studies in serotonin 5-HT4 receptor ligands based on a benzo[de][2,6]naphthridine scaffold. Eur J Med Chem 82:36-46 (2014)  
Target
Name:
5-hydroxytryptamine receptor 4
Synonyms:
5-HT-4 5-HT4S 5-HT4b 5-HT4d 5-hydroxytryptamine receptor 4 5HT4R_HUMAN Serotonin (5-HT) receptor Serotonin 4 (5-HT4) receptor | Serotonin Receptor 4
Type:
Enzyme
Mol. Mass.:
43767.54
Organism:
Homo sapiens (Human)
Description:
Q13639
Residue:
388
  
Inhibitor
Name:
BDBM50019522
Synonyms:
CHEMBL3291077
Type:
Small organic molecule
Emp. Form.:
C20H25N3O2
Mol. Mass.:
339.4314
SMILES:
COc1cc2C(=O)N(CCCN3CCCCC3)Cc3cccc(n1)c23
: