Target
Proteinase-activated receptor 1
Ligand
BDBM50020143
Substrate
Meas. Tech.
ChEMBL_1364167 (CHEMBL3292644)
Ki
25±n/a nM
Citation
 Chelliah, MVEagen, KGuo, ZChackalamannil, SXia, YTsai, HGreenlee, WJAhn, HSKurowski, SBoykow, GHsieh, YChintala, M Himbacine-derived thrombin receptor antagonists: c7-spirocyclic analogues of vorapaxar. ACS Med Chem Lett 5:561-5 (2014)  
Target
Name:
Proteinase-activated receptor 1
Synonyms:
CF2R F2R PAR1 Proteinase activated receptor 1 TR Thrombin receptor/ Proteinase-activated receptor 1(Par-1)
Type:
Protein
Mol. Mass.:
47450.07
Organism:
Homo sapiens (Human)
Description:
P25116
Residue:
425
  
Inhibitor
Name:
BDBM50020143
Synonyms:
CHEMBL3288443
Type:
Small organic molecule
Emp. Form.:
C28H29FN2O4
Mol. Mass.:
476.5393
SMILES:
[H][C@@]12C[C@]3([H])C[C@]4(COC(=O)N4)CC[C@@]3([H])[C@H](\C=C\c3ccc(cn3)-c3ccccc3F)[C@]1([H])[C@@H](C)OC2=O
: