Target
Histamine H3 receptor
Ligand
BDBM50026357
Substrate
Meas. Tech.
ChEMBL_1432176 (CHEMBL3390512)
Ki
29±n/a nM
Citation
 Lipani, LOdadzic, DWeizel, LSchwed, JSSadek, BStark, H Studies on molecular properties prediction and histamine H3 receptor affinities of novel ligands with uracil-based motifs. Eur J Med Chem 86:578-88 (2014)  
Target
Name:
Histamine H3 receptor
Synonyms:
G-protein coupled receptor 97 HH3R HRH3 Histamine H3 receptor (H3) Histamine receptor (H3 and H4)
Type:
G Protein-Coupled Receptor (GPCR)
Mol. Mass.:
48691.47
Organism:
Homo sapiens (Human)
Description:
Binding assays were using CHO cells stably expressing hH3R receptors.
Residue:
445
  
Inhibitor
Name:
BDBM50026357
Synonyms:
CHEMBL3331154
Type:
Small organic molecule
Emp. Form.:
C19H25N3O3
Mol. Mass.:
343.4201
SMILES:
O=c1cc[nH]c(=O)n1Cc1ccc(OCCCN2CCCCC2)cc1
: