Target
A disintegrin and metalloproteinase with thrombospondin motifs 5
Ligand
BDBM50033808
Substrate
Meas. Tech.
ChEMBL_1435760 (CHEMBL3388952)
IC50
35±n/a nM
Citation
 Durham, TBKlimkowski, VJRito, CJMarimuthu, JToth, JLLiu, CDurbin, JDStout, SLAdams, LSwearingen, CLin, CChambers, MGThirunavukkarasu, KWiley, MR Identification of potent and selective hydantoin inhibitors of aggrecanase-1 and aggrecanase-2 that are efficacious in both chemical and surgical models of osteoarthritis. J Med Chem 57:10476-85 (2014)  
Target
Name:
A disintegrin and metalloproteinase with thrombospondin motifs 5
Synonyms:
A disintegrin and metalloproteinase with thrombospondin motifs 5 (ADAMTS-5) ADAMTS5 ATS5_HUMAN Metalloproteinase with thrombospondin motifs 5 (ADAMTS-5)
Type:
Enzyme
Mol. Mass.:
101769.09
Organism:
Homo sapiens (Human)
Description:
Q9UNA0
Residue:
930
  
Inhibitor
Name:
BDBM50033808
Synonyms:
CHEMBL3358158
Type:
Small organic molecule
Emp. Form.:
C18H14F3N5O4
Mol. Mass.:
421.3301
SMILES:
Cn1ccnc1[C@]1(CNC(=O)c2cc3cc(ccc3o2)C(F)(F)F)NC(=O)NC1=O
: