Target
Glucose-dependent insulinotropic receptor
Ligand
BDBM50036644
Substrate
Meas. Tech.
ChEMBL_1434404 (CHEMBL3387656)
EC50
27±n/a nM
Citation
 Azimioara, MAlper, PCow, CMutnick, DNikulin, VLelais, GMecom, JMcNeill, MMichellys, PYWang, ZReding, EPaliotti, MLi, JBao, DZoll, JKim, YZimmerman, MGroessl, TTuntland, TJoseph, SBMcNamara, PSeidel, HMEpple, R Novel tricyclic pyrazolopyrimidines as potent and selective GPR119 agonists. Bioorg Med Chem Lett 24:5478-83 (2015)  
Target
Name:
Glucose-dependent insulinotropic receptor
Synonyms:
GP119_MOUSE | Gpr119
Type:
PROTEIN
Mol. Mass.:
37009.07
Organism:
Mus musculus
Description:
ChEMBL_1506420
Residue:
335
  
Inhibitor
Name:
BDBM50036644
Synonyms:
CHEMBL3354781
Type:
Small organic molecule
Emp. Form.:
C27H24F3N3O2
Mol. Mass.:
479.4936
SMILES:
CCOC(=O)[C@@]1(Cc2ccccc2)CCCc2cnc3c(cnn3c12)-c1ccc(cc1)C(F)(F)F
: