Target
Glutathione S-transferase Mu 2
Ligand
BDBM50038334
Substrate
Meas. Tech.
ChEMBL_1441153 (CHEMBL3378817)
IC50
6.0±n/a nM
Citation
 Rotili, DDe Luca, ATarantino, DPezzola, SForgione, MMorozzo Della Rocca, BFalconi, MMai, ACaccuri, AM Synthesis and structure--activity relationship of new cytotoxic agents targeting human glutathione-S-transferases. Eur J Med Chem 89:156-71 (2014)  
Target
Name:
Glutathione S-transferase Mu 2
Synonyms:
GST class-mu 2 GSTM2 GSTM2_HUMAN | Glutathione S-transferase Mu 2
Type:
PROTEIN
Mol. Mass.:
25743.85
Organism:
Homo sapiens (Human)
Description:
ChEMBL_1441153
Residue:
218
  
Inhibitor
Name:
BDBM50038334
Synonyms:
CHEMBL3360535
Type:
Small organic molecule
Emp. Form.:
C14H19N3O4S
Mol. Mass.:
325.383
SMILES:
OCCCCCCCCSc1ccc([N+]([O-])=O)c2nonc12
: