Target
C-C chemokine receptor type 3
Ligand
BDBM50041174
Substrate
Meas. Tech.
ChEMBL_1445728 (CHEMBL3374865)
Ki
33±n/a nM
Citation
 Kriegl, JMMartyres, DGrundl, MAAnderskewitz, RDollinger, HRast, GSchmid, BSeither, PTautermann, CS Rodent selectivity of piperidine-4-yl-1H-indoles, a series of CC chemokine receptor-3 (CCR3) antagonists: insights from a receptor model. Bioorg Med Chem Lett 25:229-35 (2014)  
Target
Name:
C-C chemokine receptor type 3
Synonyms:
C-C CKR-3 CC-CKR-3 CCR3 CD_antigen=CD193 CMKBR3 | Eosinophil eotaxin receptor
Type:
Enzyme
Mol. Mass.:
41053.88
Organism:
Homo sapiens (Human)
Description:
P51677
Residue:
355
  
Inhibitor
Name:
BDBM50041174
Synonyms:
CHEMBL3355938
Type:
Small organic molecule
Emp. Form.:
C23H26F2N2S
Mol. Mass.:
400.528
SMILES:
Cc1[nH]c2cc(F)ccc2c1C1CCN(CCCSc2ccc(F)cc2)CC1
: