Target
Cytochrome P450 3A4
Ligand
BDBM50046175
Substrate
Meas. Tech.
ChEMBL_1447575 (CHEMBL3373770)
IC50
51000±n/a nM
Citation
 Hoekstra, WJGarvey, EPMoore, WRRafferty, SWYates, CMSchotzinger, RJ Design and optimization of highly-selective fungal CYP51 inhibitors. Bioorg Med Chem Lett 24:3455-8 (2014)  
Target
Name:
Cytochrome P450 3A4
Synonyms:
Albendazole monooxygenase CP3A4_HUMAN CYP3A4 CYPIIIA4 Cytochrome P450 3A4 (CYP3A4) Nifedipine oxidase Taurochenodeoxycholate 6-alpha-hydroxylase
Type:
Enzyme
Mol. Mass.:
57349.57
Organism:
Homo sapiens (Human)
Description:
Residue:
503
  
Inhibitor
Name:
BDBM50046175
Synonyms:
CHEMBL3358963
Type:
Small organic molecule
Emp. Form.:
C16H14F3N5O
Mol. Mass.:
349.3105
SMILES:
C[C@@H](c1ncncc1F)[C@](O)(Cn1cnnc1)c1ccc(F)cc1F
: