Target
Cytochrome P450 3A4
Ligand
BDBM50046184
Substrate
Meas. Tech.
ChEMBL_1447575 (CHEMBL3373770)
IC50
36000±n/a nM
Citation
 Hoekstra, WJGarvey, EPMoore, WRRafferty, SWYates, CMSchotzinger, RJ Design and optimization of highly-selective fungal CYP51 inhibitors. Bioorg Med Chem Lett 24:3455-8 (2014)  
Target
Name:
Cytochrome P450 3A4
Synonyms:
Albendazole monooxygenase CP3A4_HUMAN CYP3A4 CYPIIIA4 Cytochrome P450 3A4 (CYP3A4) Nifedipine oxidase Taurochenodeoxycholate 6-alpha-hydroxylase
Type:
Enzyme
Mol. Mass.:
57349.57
Organism:
Homo sapiens (Human)
Description:
Residue:
503
  
Inhibitor
Name:
BDBM50046184
Synonyms:
CHEMBL3311225
Type:
Small organic molecule
Emp. Form.:
C21H14ClF4N5O
Mol. Mass.:
463.815
SMILES:
O[C@@](Cn1cnnn1)(c1ccc(F)cc1F)C(F)(F)c1ccc(cn1)-c1ccc(Cl)cc1
: