Target
Carbonic anhydrase 2
Ligand
BDBM50050777
Substrate
Meas. Tech.
ChEMBL_1459253 (CHEMBL3367483)
Ki
26±n/a nM
Citation
 De Monte, CCarradori, SSecci, DD'Ascenzio, MVullo, DCeruso, MSupuran, CT Cyclic tertiary sulfamates: selective inhibition of the tumor-associated carbonic anhydrases IX and XII by N- and O-substituted acesulfame derivatives. Eur J Med Chem 84:240-6 (2014)  
Target
Name:
Carbonic anhydrase 2
Synonyms:
CA-II CAC Carbonate dehydratase II Carbonic anhydrase 2 (CA-II) Carbonic anhydrase C Carbonic anhydrase II (CA-II) Carbonic anhydrase II (hCA II) | Carbonic anhydrase isoenzyme II (hCA II)
Type:
Enzyme
Mol. Mass.:
29250.71
Organism:
Homo sapiens (Human)
Description:
P00918
Residue:
260
  
Inhibitor
Name:
BDBM50050777
Synonyms:
CHEMBL3322525
Type:
Small organic molecule
Emp. Form.:
C12H10N2O7S
Mol. Mass.:
326.282
SMILES:
CC1=CC(=O)N(CC(=O)c2cccc(c2)[N+]([O-])=O)S(=O)(=O)O1
: