Target
Carbonic anhydrase 9
Ligand
BDBM50050843
Substrate
Meas. Tech.
ChEMBL_1459254 (CHEMBL3367484)
Ki
47±n/a nM
Citation
 De Monte, CCarradori, SSecci, DD'Ascenzio, MVullo, DCeruso, MSupuran, CT Cyclic tertiary sulfamates: selective inhibition of the tumor-associated carbonic anhydrases IX and XII by N- and O-substituted acesulfame derivatives. Eur J Med Chem 84:240-6 (2014)  
Target
Name:
Carbonic anhydrase 9
Synonyms:
CA-IX CAH9_HUMAN Carbonic anhydrase 9 (CA IX) Carbonic anhydrase 9 precursor Carbonic anhydrase IX (CAIX) Carbonic anhydrases; II & IX MN RCC-associated antigen G250
Type:
Enzyme
Mol. Mass.:
49669.03
Organism:
Homo sapiens (Human)
Description:
Catalytic domain of human cloned isozyme was used in the assay
Residue:
459
  
Inhibitor
Name:
BDBM50050843
Synonyms:
CHEMBL3322442
Type:
Small organic molecule
Emp. Form.:
C8H11NO6S
Mol. Mass.:
249.241
SMILES:
CCOC(=O)CN1C(=O)C=C(C)OS1(=O)=O
: