Target
Peroxisome proliferator-activated receptor alpha
Ligand
BDBM50063088
Substrate
Meas. Tech.
ChEMBL_1463126 (CHEMBL3399109)
IC50
2020±n/a nM
Citation
 Zhang, HDing, CZLai, ZChen, SSDevasthale, PHerpin, TMorton, GQu, FRyono, DSmirk, RWang, WWu, SYe, XXLi, YXApedo, AFarrelly, DWang, TGu, LMorgan, NFlynn, NChu, CKunselman, LLippy, JLocke, KO'Malley, KHarrity, TCap, MZhang, LHosagrahara, VKadiyala, PXu, CDoweyko, AMZahler, RHariharan, NCheng, PT Synthesis and biological evaluation of novel pyrrolidine acid analogs as potent dual PPARa/¿ agonists. Bioorg Med Chem Lett 25:1196-205 (2015)  
Target
Name:
Peroxisome proliferator-activated receptor alpha
Synonyms:
NR1C1 PPAR PPAR-alpha PPARA_HUMAN Peroxisome proliferator-activated receptor | Peroxisome proliferator-activated receptor alpha (PPAR alpha)
Type:
Enzyme
Mol. Mass.:
52222.08
Organism:
Homo sapiens (Human)
Description:
Q07869
Residue:
468
  
Inhibitor
Name:
BDBM50063088
Synonyms:
CHEMBL3398442
Type:
Small organic molecule
Emp. Form.:
C27H30N2O6
Mol. Mass.:
478.5369
SMILES:
CCOC(=O)N1C[C@@H](Cc2ccc(OCCc3nc(oc3C)-c3ccccc3)cc2)[C@H](C1)C(O)=O
: