Target
Lysophosphatidic acid receptor 1
Ligand
BDBM50065614
Substrate
Meas. Tech.
ChEMBL_1463949 (CHEMBL3405601)
IC50
>800±n/a nM
Citation
 Kusumi, KShinozaki, KKanaji, TKurata, HNaganawa, AOtsuki, KMatsushita, TSekiguchi, TKakuuchi, ASeko, T Discovery of novel S1P2 antagonists. Part 1: discovery of 1,3-bis(aryloxy)benzene derivatives. Bioorg Med Chem Lett 25:1479-82 (2015)  
Target
Name:
Lysophosphatidic acid receptor 1
Synonyms:
EDG2 LPA-1 LPAR1 Lysophosphatidic acid receptor 1 (LPA1) | Lysophosphatidic acid receptor Edg-2
Type:
Enzyme
Mol. Mass.:
41120.55
Organism:
Homo sapiens (Human)
Description:
Q92633
Residue:
364
  
Inhibitor
Name:
BDBM50065614
Synonyms:
CHEMBL3401386
Type:
Small organic molecule
Emp. Form.:
C32H38FN3O5
Mol. Mass.:
563.6596
SMILES:
CCC(CC)CC1(O)CCN(CC1)C(=O)Nc1cc(Oc2ccc(F)cc2)cc(Oc2ccc(cc2)C(=O)NC)c1
: