Target
M-phase inducer phosphatase 2
Ligand
BDBM50084504
Substrate
Meas. Tech.
ChEMBL_1477889 (CHEMBL3429168)
Ki
1900±n/a nM
Citation
 George Rosenker, KMPaquette, WDJohnston, PASharlow, ERVogt, ABakan, ALazo, JSWipf, P Synthesis and biological evaluation of 3-aminoisoquinolin-1(2H)-one based inhibitors of the dual-specificity phosphatase Cdc25B. Bioorg Med Chem 23:2810-8 (2015)  
Target
Name:
M-phase inducer phosphatase 2
Synonyms:
CDC25B Dual specificity phosphatase (CDC25B) M-phase inducer phosphatase 2 (CDC25B) | MPIP2_HUMAN
Type:
Protein
Mol. Mass.:
64985.27
Organism:
Homo sapiens (Human)
Description:
Residue:
580
  
Inhibitor
Name:
BDBM50084504
Synonyms:
CHEMBL3426991
Type:
Small organic molecule
Emp. Form.:
C21H17N3O
Mol. Mass.:
327.3792
SMILES:
Nc1cccc(c1)-c1ccc2c(cc(Nc3ccccc3)[nH]c2=O)c1
: