Target
Platelet-derived growth factor receptor alpha
Ligand
BDBM50331095
Substrate
Meas. Tech.
ChEMBL_1476220 (CHEMBL3429406)
IC50
2.3±n/a nM
Citation
 Guo, SPang, XPeng, LZhan, MFan, LGong, YKang, FChen, Y Design, synthesis and biological evaluation of deuterated Tivozanib for improving pharmacokinetic properties. Bioorg Med Chem Lett 25:2425-8 (2015)  
Target
Name:
Platelet-derived growth factor receptor alpha
Synonyms:
Alpha-type platelet-derived growth factor receptor PDGFRA PGFRA_HUMAN Platelet-derived growth factor receptor alpha (PDGFRA) RHEPDGFRA
Type:
Protein
Mol. Mass.:
122633.38
Organism:
Homo sapiens (Human)
Description:
P16234
Residue:
1089
  
Inhibitor
Name:
BDBM50331095
Synonyms:
CHEMBL1289494 US10464902, Tivozanib
Type:
Small organic molecule
Emp. Form.:
C22H19ClN4O5
Mol. Mass.:
454.863
SMILES:
COc1cc2nccc(Oc3ccc(NC(=O)Nc4cc(C)on4)c(Cl)c3)c2cc1OC
: