Target
Cytochrome P450 2C9
Ligand
BDBM50101976
Substrate
Meas. Tech.
ChEMBL_1485117 (CHEMBL3540468)
Ki
6800±n/a nM
Citation
 Yasuda, KIkushiro, SWakayama, SItoh, TYamamoto, KKamakura, MMunetsuna, EOhta, MSakaki, T Comparison of metabolism of sesamin and episesamin by drug-metabolizing enzymes in human liver. Drug Metab Dispos 40:1917-26 (2012)  
Target
Name:
Cytochrome P450 2C9
Synonyms:
(R)-limonene 6-monooxygenase CP2C9_HUMAN CYP2C9 Cytochrome P450 2C9 (CYP2C9 ) P-450MP P450 PB-1 | S-mephenytoin 4-hydroxylase
Type:
Enzyme
Mol. Mass.:
55636.33
Organism:
Homo sapiens (Human)
Description:
P11712
Residue:
490
  
Inhibitor
Name:
BDBM50101976
Synonyms:
ASARININ | Episesamin
Type:
Small organic molecule
Emp. Form.:
C20H18O6
Mol. Mass.:
354.3533
SMILES:
[H][C@]12CO[C@H](c3ccc4OCOc4c3)[C@@]1([H])CO[C@H]2c1ccc2OCOc2c1
: