Target
Kynurenine 3-monooxygenase
Ligand
BDBM50088519
Substrate
Meas. Tech.
ChEMBL_1487469 (CHEMBL3536664)
IC50
17000±n/a nM
Citation
 Beconi, MGYates, DLyons, KMatthews, KClifton, SMead, TPrime, MWinkler, DO'Connell, CWalter, DToledo-Sherman, LMunoz-Sanjuan, IDominguez, C Metabolism and pharmacokinetics of JM6 in mice: JM6 is not a prodrug for Ro-61-8048. Drug Metab Dispos 40:2297-306 (2012)  
Target
Name:
Kynurenine 3-monooxygenase
Synonyms:
KMO | KMO_HUMAN
Type:
PROTEIN
Mol. Mass.:
55831.03
Organism:
Homo sapiens (Human)
Description:
ChEMBL_1487479
Residue:
486
  
Inhibitor
Name:
BDBM50088519
Synonyms:
CHEMBL3526743
Type:
Small organic molecule
Emp. Form.:
C18H18N4O6S2
Mol. Mass.:
450.489
SMILES:
COc1ccc(cc1OC)S(=O)(=O)Nc1nc(c(CN)s1)-c1cccc(c1)[N+]([O-])=O
: