Target
Histamine H3 receptor
Ligand
BDBM50089370
Substrate
Meas. Tech.
ChEMBL_1496464 (CHEMBL3578410)
Ki
1.5±n/a nM
Citation
 Letavic, MAAluisio, LApodaca, RBajpai, MBarbier, AJBonneville, ABonaventure, PCarruthers, NIDugovic, CFraser, ICKramer, MLLord, BLovenberg, TWLi, LYLy, KSMcallister, HMani, NSMorton, KLNdifor, ANepomuceno, SDPandit, CRSands, SBShah, CRShelton, JESnook, SSSwanson, DMXiao, W Novel benzamide-based histamine h3 receptor antagonists: the identification of two candidates for clinical development. ACS Med Chem Lett 6:450-4 (2015)  
Target
Name:
Histamine H3 receptor
Synonyms:
G-protein coupled receptor 97 HH3R HRH3 Histamine H3 receptor (H3) Histamine receptor (H3 and H4)
Type:
G Protein-Coupled Receptor (GPCR)
Mol. Mass.:
48691.47
Organism:
Homo sapiens (Human)
Description:
Binding assays were using CHO cells stably expressing hH3R receptors.
Residue:
445
  
Inhibitor
Name:
BDBM50089370
Synonyms:
CHEMBL3577958
Type:
Small organic molecule
Emp. Form.:
C20H30FN3O
Mol. Mass.:
347.4701
SMILES:
CC(C)N1CCN(CC1)C(=O)c1ccc(CN2CCC(F)CC2)cc1
: