Target
Cytochrome P450 11B1, mitochondrial
Ligand
BDBM50092196
Substrate
Meas. Tech.
ChEMBL_1498858 (CHEMBL3583832)
IC50
677±n/a nM
Target
Name:
Cytochrome P450 11B1, mitochondrial
Synonyms:
C11B1_HUMAN CYPXIB1 Cytochrome P450 11B1 Cytochrome P450 11B1, mitochondrial | S11BH
Type:
Enzyme
Mol. Mass.:
57591.44
Organism:
Homo sapiens (Human)
Description:
P15538
Residue:
503
  
Inhibitor
Name:
BDBM50092196
Synonyms:
CHEMBL3582447
Type:
Small organic molecule
Emp. Form.:
C13H10FN3
Mol. Mass.:
227.237
SMILES:
Cn1c(nc2ccc(F)cc12)-c1cccnc1
: