Target
Estrogen-related receptor gamma
Ligand
BDBM50093527
Substrate
Meas. Tech.
ChEMBL_1501351 (CHEMBL3588215)
Kd
46000±n/a nM
Citation
 Xu, SMao, LDing, PZhuang, XZhou, YYu, LLiu, YNie, TXu, TXu, YLiu, JSmaill, JRen, XWu, DDing, K 1-Benzyl-4-phenyl-1H-1,2,3-triazoles improve the transcriptional functions of estrogen-related receptor¿ and promote the browning of white adipose. Bioorg Med Chem 23:3751-60 (2015)  
Target
Name:
Estrogen-related receptor gamma
Synonyms:
ERR gamma-2 ERR3_HUMAN ESRRG Estrogen-Related Receptor, gamma KIAA0832 Nuclear receptor subfamily 3 group B member 3
Type:
PROTEIN
Mol. Mass.:
51305.00
Organism:
Homo sapiens (Human)
Description:
ChEMBL_1501351
Residue:
458
  
Inhibitor
Name:
BDBM50093527
Synonyms:
CHEMBL3585698
Type:
Small organic molecule
Emp. Form.:
C18H19N3O2
Mol. Mass.:
309.3624
SMILES:
CC(C)c1ccc(Cn2cc(nn2)-c2ccc(O)c(O)c2)cc1
: