Target
Amine oxidase [flavin-containing] A
Ligand
BDBM50093713
Substrate
Meas. Tech.
ChEMBL_1501477 (CHEMBL3586839)
IC50
96.0±n/a nM
Citation
 Khattab, SNHaiba, NSAsal, AMBekhit, AAAmer, AAbdel-Rahman, HMEl-Faham, A Synthesis and evaluation of quinazoline amino acid derivatives as mono amine oxidase (MAO) inhibitors. Bioorg Med Chem 23:3574-85 (2015)  
Target
Name:
Amine oxidase [flavin-containing] A
Synonyms:
AOFA_BOVIN MAO-A Monoamine Oxidase Type A (MAO-A) Monoamine oxidase A | Monoamine oxidase type A
Type:
PROTEIN
Mol. Mass.:
59764.63
Organism:
Bos taurus
Description:
ChEMBL_1501477
Residue:
527
  
Inhibitor
Name:
BDBM50093713
Synonyms:
CHEMBL3585834
Type:
Small organic molecule
Emp. Form.:
C17H18N2O4
Mol. Mass.:
314.3358
SMILES:
COC(=O)CCCN1C(Nc2ccccc2C1=O)c1ccco1
: