Target
Formyl peptide receptor-related sequence 1
Ligand
BDBM50097561
Substrate
Meas. Tech.
ChEMBL_1504350 (CHEMBL3592687)
EC50
3900±n/a nM
Citation
 Lacivita, ESchepetkin, IAStama, MLKirpotina, LNColabufo, NAPerrone, RKhlebnikov, AIQuinn, MTLeopoldo, M Novel 3-(1H-indol-3-yl)-2-[3-(4-methoxyphenyl)ureido]propanamides as selective agonists of human formyl-peptide receptor 2. Bioorg Med Chem 23:3913-24 (2015)  
Target
Name:
Formyl peptide receptor-related sequence 1
Synonyms:
FMLP-R-I FPRS1_MOUSE Formyl peptide receptor-like 1 Fpr2 Fprl1 Lipoxin A4 receptor N-formyl peptide receptor 2 | N-formyl peptide receptor 3
Type:
PROTEIN
Mol. Mass.:
39532.25
Organism:
Mus musculus
Description:
ChEMBL_109574
Residue:
351
  
Inhibitor
Name:
BDBM50097561
Synonyms:
CHEMBL3590071
Type:
Small organic molecule
Emp. Form.:
C31H35N5O3
Mol. Mass.:
525.6413
SMILES:
COc1ccc(NC(=O)N[C@@H](Cc2c[nH]c3ccccc23)C(=O)NCC2(CCCCC2)c2cccnc2)cc1
: