Target
Estrogen receptor
Ligand
BDBM50094708
Substrate
Meas. Tech.
ChEMBL_1504564 (CHEMBL3591305)
IC50
10800±n/a nM
Citation
 Tang, CLi, CZhang, SHu, ZWu, JDong, CHuang, JZhou, HB Novel Bioactive Hybrid Compound Dual Targeting Estrogen Receptor and Histone Deacetylase for the Treatment of Breast Cancer. J Med Chem 58:4550-72 (2015)  
Target
Name:
Estrogen receptor
Synonyms:
ER ESR ESR1_HUMAN Estrogen receptor Estrogen receptor (ER-alpha) Estrogen receptor alpha (ER) Nuclear receptor subfamily 3 group A member 1
Type:
Protein
Mol. Mass.:
66230.44
Organism:
Homo sapiens (Human)
Description:
P03372
Residue:
595
  
Inhibitor
Name:
BDBM50094708
Synonyms:
CHEMBL3589347
Type:
Small organic molecule
Emp. Form.:
C33H35NO9S
Mol. Mass.:
621.697
SMILES:
COC(=O)CCCCCCC(=O)Nc1ccc(OS(=O)(=O)C2CC3OC2C(=C3c2ccc(O)cc2)c2ccc(O)cc2)cc1
: