Target
Vesicular acetylcholine transporter
Ligand
BDBM50095010
Substrate
Meas. Tech.
ChEMBL_1503354 (CHEMBL3590745)
Ki
18±n/a nM
Citation
 Barthel, CSorger, DDeuther-Conrad, WScheunemann, MSchweiger, SJäckel, PRoghani, ASteinbach, JSchüürmann, GSabri, OBrust, PWenzel, B New systematically modified vesamicol analogs and their affinity and selectivity for the vesicular acetylcholine transporter - A critical examination of the lead structure. Eur J Med Chem 100:50-67 (2015)  
Target
Name:
Vesicular acetylcholine transporter
Synonyms:
Slc18a3 VACHT_RAT Vat | rVAT
Type:
PROTEIN
Mol. Mass.:
56533.41
Organism:
Rattus norvegicus
Description:
ChEMBL_1503353
Residue:
530
  
Inhibitor
Name:
BDBM50095010
Synonyms:
CHEMBL264437
Type:
Small organic molecule
Emp. Form.:
C17H23NO
Mol. Mass.:
257.3706
SMILES:
O[C@@H]1CC=CC[C@H]1N1CCC(CC1)c1ccccc1
: