Target
Vesicular acetylcholine transporter
Ligand
BDBM50095012
Substrate
Meas. Tech.
ChEMBL_1503354 (CHEMBL3590745)
Ki
112±n/a nM
Citation
 Barthel, CSorger, DDeuther-Conrad, WScheunemann, MSchweiger, SJäckel, PRoghani, ASteinbach, JSchüürmann, GSabri, OBrust, PWenzel, B New systematically modified vesamicol analogs and their affinity and selectivity for the vesicular acetylcholine transporter - A critical examination of the lead structure. Eur J Med Chem 100:50-67 (2015)  
Target
Name:
Vesicular acetylcholine transporter
Synonyms:
Slc18a3 VACHT_RAT Vat | rVAT
Type:
PROTEIN
Mol. Mass.:
56533.41
Organism:
Rattus norvegicus
Description:
ChEMBL_1503353
Residue:
530
  
Inhibitor
Name:
BDBM50095012
Synonyms:
CHEMBL3589730
Type:
Small organic molecule
Emp. Form.:
C20H30N2O
Mol. Mass.:
314.465
SMILES:
O[C@@H]1Cc2ccccc2C[C@H]1N1CCC(CC1)N1CCCCC1
: