Target
Vesicular acetylcholine transporter
Ligand
BDBM50039613
Substrate
Meas. Tech.
ChEMBL_1503353 (CHEMBL3590744)
Ki
23±n/a nM
Citation
 Barthel, CSorger, DDeuther-Conrad, WScheunemann, MSchweiger, SJäckel, PRoghani, ASteinbach, JSchüürmann, GSabri, OBrust, PWenzel, B New systematically modified vesamicol analogs and their affinity and selectivity for the vesicular acetylcholine transporter - A critical examination of the lead structure. Eur J Med Chem 100:50-67 (2015)  
Target
Name:
Vesicular acetylcholine transporter
Synonyms:
Slc18a3 VACHT_RAT Vat | rVAT
Type:
PROTEIN
Mol. Mass.:
56533.41
Organism:
Rattus norvegicus
Description:
ChEMBL_1503353
Residue:
530
  
Inhibitor
Name:
BDBM50039613
Synonyms:
(2R,3R)-3-(4-Phenyl-piperidin-1-yl)-1,2,3,4-tetrahydro-naphthalen-2-ol CHEMBL87379 | trans-3-(4-phenylpiperidin-1-yl)-1,2,3,4-tetrahydronaphthalen-2-ol
Type:
Small organic molecule
Emp. Form.:
C21H25NO
Mol. Mass.:
307.4293
SMILES:
O[C@@H]1Cc2ccccc2C[C@H]1N1CCC(CC1)c1ccccc1
: