Target
Sodium channel protein type 3 subunit alpha
Ligand
BDBM50095314
Substrate
Meas. Tech.
ChEMBL_1503945 (CHEMBL3590774)
IC50
3500±n/a nM
Citation
 Bagal, SKBungay, PJDenton, SMGibson, KRGlossop, MSHay, TLKemp, MILane, CALewis, MLMaw, GNMillion, WAPayne, CEPoinsard, CRawson, DJStammen, BLStevens, EBThompson, LR Discovery and Optimization of Selective Nav1.8 Modulator Series That Demonstrate Efficacy in Preclinical Models of Pain. ACS Med Chem Lett 6:650-4 (2015)  
Target
Name:
Sodium channel protein type 3 subunit alpha
Synonyms:
KIAA1356 NAC3 SCN3A_HUMAN Sodium channel alpha subunits; brain (Types I, II, III) Voltage-gated sodium channel subunit alpha Nav1.3 (Nav1.3)
Type:
Protein
Mol. Mass.:
226276.42
Organism:
Homo sapiens (Human)
Description:
Q9NY46
Residue:
2000
  
Inhibitor
Name:
BDBM50095314
Synonyms:
CHEMBL3589893
Type:
Small organic molecule
Emp. Form.:
C13H10Cl3N3O
Mol. Mass.:
330.597
SMILES:
CC(=O)Nc1ccc(c(N)n1)-c1cc(Cl)cc(Cl)c1Cl
: