Target
Putative P2Y purinoceptor 10
Ligand
BDBM50096435
Substrate
Meas. Tech.
ChEMBL_1495909 (CHEMBL3579720)
EC50
2042±n/a nM
Citation
 Ikubo, MInoue, ANakamura, SJung, SSayama, MOtani, YUwamizu, ASuzuki, KKishi, TShuto, AIshiguro, JOkudaira, MKano, KMakide, KAoki, JOhwada, T Structure-activity relationships of lysophosphatidylserine analogs as agonists of G-protein-coupled receptors GPR34, P2Y10, and GPR174. J Med Chem 58:4204-19 (2015)  
Target
Name:
Putative P2Y purinoceptor 10
Synonyms:
P2RY10 P2Y10 Putative P2Y purinoceptor 10
Type:
PROTEIN
Mol. Mass.:
38793.96
Organism:
Homo sapiens (Human)
Description:
ChEMBL_109762
Residue:
339
  
Inhibitor
Name:
BDBM50096435
Synonyms:
CHEMBL3577163
Type:
Small organic molecule
Emp. Form.:
C23H44NO9P
Mol. Mass.:
509.5705
SMILES:
CCCCCC\C=C/CCCCCCCC(=O)OC[C@@H](O)COP(O)(=O)O[C@@H](C)[C@H](N)C(O)=O
: