Target
Glucose-dependent insulinotropic receptor
Ligand
BDBM50100549
Substrate
Meas. Tech.
ChEMBL_1456739 (CHEMBL3371029)
EC50
173±n/a nM
Citation
 Jeon, MKLee, KMKim, IHJang, YKKang, SKLee, JMJung, KYKumar, JARhee, SDJung, WHSong, JSBae, MAKim, KRAhn, JH Synthesis and biological evaluation of thienopyrimidine derivatives as GPR119 agonists. Bioorg Med Chem Lett 24:4281-5 (2014)  
Target
Name:
Glucose-dependent insulinotropic receptor
Synonyms:
G-protein coupled receptor 119 (GPR119) GPR119 | Glucose-dependent insulinotropic receptor
Type:
Protein
Mol. Mass.:
36901.49
Organism:
Homo sapiens (Human)
Description:
Q8TDV5
Residue:
335
  
Inhibitor
Name:
BDBM50100549
Synonyms:
CHEMBL3321831
Type:
Small organic molecule
Emp. Form.:
C23H26N4O3S2
Mol. Mass.:
470.608
SMILES:
CN(C1CCN(CC1)C(=O)C1CC1)c1ncnc2c(csc12)-c1ccc(cc1)S(C)(=O)=O
: