Target
Tyrosine-protein phosphatase non-receptor type 5
Ligand
BDBM50067504
Substrate
Meas. Tech.
ChEMBL_1462478 (CHEMBL3398881)
Ki
235±n/a nM
Citation
 Baguley, TDNairn, ACLombroso, PJEllman, JA Synthesis of benzopentathiepin analogs and their evaluation as inhibitors of the phosphatase STEP. Bioorg Med Chem Lett 25:1044-6 (2015)  
Target
Name:
Tyrosine-protein phosphatase non-receptor type 5
Synonyms:
PTN5_HUMAN Tyrosine-protein phosphatase non-receptor type 5 | Tyrosine-protein phosphatase non-receptor type 5 isoform a
Type:
Enzyme Catalytic Domain
Mol. Mass.:
63510.68
Organism:
Homo sapiens (Human)
Description:
gi_90652859
Residue:
565
  
Inhibitor
Name:
BDBM50067504
Synonyms:
CHEMBL3398246
Type:
Small organic molecule
Emp. Form.:
C9H3F6NOS5
Mol. Mass.:
415.442
SMILES:
FC(F)(F)C(=O)Nc1cc(cc2SSSSSc12)C(F)(F)F
: